{"text_format":"3","workbook":"xlsx","n_sheets":2,"sheets":["convert","helper table"],"not_rendered":{"images":4,"macros":1,"defined_names":5},"read":"whole","date_system":"1900"}

{"sheet":"convert","index":0,"n_rows":20,"n_cols":2,"rows_kept":20}
[null,"Choose Date Conversion"]
[]
[]
[null,"Input Date:"]
[]
[]
[null,{"$f":"IFERROR(\"(\"&'helper table'!D11&\")\",\"\")","v":"(Common Year)"}]
[]
[null,"Result Date:"]
[null,{"$f":"IFERROR(IF('helper table'!D6=\"Gregori to Hijri\",'helper table'!F2&\" \"&'helper table'!F4&\" \"&'helper table'!F5&\" H\",'helper table'!G2&\" \"&'helper table'!G4&'helper table'!G5),\"\")","v":"19 Dzulhijjah 1397 H"}]
[null,{"$f":"IFERROR(\"(\"&'helper table'!G6&\")\",\"\")","v":"(Common Year)"}]
[]
[null,{"$f":"IFERROR(\"(\"&\"your age is \"&'helper table'!G7&\" old\"&\")\",\"\")","v":"(your age is 37 years 10 months 29 days old)"}]
[]
[]
[]
[]
[]
[1]
[2]

{"sheet":"helper table","index":1,"n_rows":32,"n_cols":7,"rows_kept":32,"merged":[[0,4,0,5]]}
["Date","Month","Month-2","Option","Calculation"]
[1,"January","Muharram","Gregori to Hijri",{"$f":"IF($D$6=\"Gregori to Hijri\",INDEX(gregori,ROWS($A$1:A1)),INDEX(hijri,ROWS($A$1:A1)))","v":"January"},{"$f":"IF(D6=\"Gregori to Hijri\",MOD(1720995+INT(IF(D8<3,D10-1,D10)*365.25)+INT((IF(D8<3,D8+12,D8)+1)*30.6)+D7+IF(IF(IF(D8<3,D10-1,D10)>1582,TRUE,IF(IF(D8<3,D8+12,D8)>11,TRUE,IF(D7>=15,TRUE,FALSE))),2-INT(IF(D8<3,D10-1,D10)/100)+INT(INT(IF(D8<3,D10-1,D10)/100)/4),0)-1948440,10631)-MAX(IF(MOD(1720995+INT(IF(D8<3,D10-1,D10)*365.25)+INT((IF(D8<3,D8+12,D8)+1)*30.6)+D7+IF(IF(IF(D8<3,D10-1,D10)>1582,TRUE,IF(IF(D8<3,D8+12,D8)>11,TRUE,IF(D7>=15,TRUE,FALSE))),2-INT(IF(D8<3,D10-1,D10)/100)+INT(INT(IF(D8<3,D10-1,D10)/100)/4),0)-1948440,10631)>{354;709;1063;1417;1771;2126;2480;2835;3189;3543;3898;4252;4606;4961;5315;5670;6024;6378;6733;7087;7441;7796;8150;8504;8859;9213;9568;9922;10276},1,0)*({354;709;1063;1417;1771;2126;2480;2835;3189;3543;3898;4252;4606;4961;5315;5670;6024;6378;6733;7087;7441;7796;8150;8504;8859;9213;9568;9922;10276}))-MAX(IF(MOD(1720995+INT(IF(D8<3,D10-1,D10)*365.25)+INT((IF(D8<3,D8+12,D8)+1)*30.6)+D7+IF(IF(IF(D8<3,D10-1,D10)>1582,TRUE,IF(IF(D8<3,D8+12,D8)>11,TRUE,IF(D7>=15,TRUE,FALSE))),2-INT(IF(D8<3,D10-1,D10)/100)+INT(INT(IF(D8<3,D10-1,D10)/100)/4),0)-1948440,10631)-MAX(IF(MOD(1720995+INT(IF(D8<3,D10-1,D10)*365.25)+INT((IF(D8<3,D8+12,D8)+1)*30.6)+D7+IF(IF(IF(D8<3,D10-1,D10)>1582,TRUE,IF(IF(D8<3,D8+12,D8)>11,TRUE,IF(D7>=15,TRUE,FALSE))),2-INT(IF(D8<3,D10-1,D10)/100)+INT(INT(IF(D8<3,D10-1,D10)/100)/4),0)-1948440,10631)>{354;709;1063;1417;1771;2126;2480;2835;3189;3543;3898;4252;4606;4961;5315;5670;6024;6378;6733;7087;7441;7796;8150;8504;8859;9213;9568;9922;10276},1,0)*({354;709;1063;1417;1771;2126;2480;2835;3189;3543;3898;4252;4606;4961;5315;5670;6024;6378;6733;7087;7441;7796;8150;8504;8859;9213;9568;9922;10276}))>{0;30;59;89;118;148;177;207;236;266;295;325},1,0)*({0;30;59;89;118;148;177;207;236;266;295;325}))+1,\"\")","v":19},{"$f":"IF(D6=\"Hijri to Gregori\",((F6-F8)-INT((30.6001*F9))),\"\")","v":""}]
[2,"February","Shafar","Hijri to Gregori",{"$f":"IF($D$6=\"Gregori to Hijri\",INDEX(gregori,ROWS($A$1:A2)),INDEX(hijri,ROWS($A$1:A2)))","v":"February"},{"$f":"IF(D6=\"Gregori to Hijri\",SUM(IF(MOD(1720995+INT(IF(D8<3,D10-1,D10)*365.25)+INT((IF(D8<3,D8+12,D8)+1)*30.6)+D7+IF(IF(IF(D8<3,D10-1,D10)>1582,TRUE,IF(IF(D8<3,D8+12,D8)>11,TRUE,IF(D7>=15,TRUE,FALSE))),2-INT(IF(D8<3,D10-1,D10)/100)+INT(INT(IF(D8<3,D10-1,D10)/100)/4),0)-1948440,10631)-MAX(IF(MOD(1720995+INT(IF(D8<3,D10-1,D10)*365.25)+INT((IF(D8<3,D8+12,D8)+1)*30.6)+D7+IF(IF(IF(D8<3,D10-1,D10)>1582,TRUE,IF(IF(D8<3,D8+12,D8)>11,TRUE,IF(D7>=15,TRUE,FALSE))),2-INT(IF(D8<3,D10-1,D10)/100)+INT(INT(IF(D8<3,D10-1,D10)/100)/4),0)-1948440,10631)>{354;709;1063;1417;1771;2126;2480;2835;3189;3543;3898;4252;4606;4961;5315;5670;6024;6378;6733;7087;7441;7796;8150;8504;8859;9213;9568;9922;10276},1,0)*({354;709;1063;1417;1771;2126;2480;2835;3189;3543;3898;4252;4606;4961;5315;5670;6024;6378;6733;7087;7441;7796;8150;8504;8859;9213;9568;9922;10276}))>={0;30;59;89;118;148;177;207;236;266;295;325},1,0)),\"\")","v":12},{"$f":"IF(D6=\"Hijri to Gregori\",IF((F9<14),(F9-1),(F9-13)),\"\")","v":""}]
[3,"March","Rabi'ul Awwal",null,{"$f":"IF($D$6=\"Gregori to Hijri\",INDEX(gregori,ROWS($A$1:A3)),INDEX(hijri,ROWS($A$1:A3)))","v":"March"},{"$f":"IF(D6=\"Gregori to Hijri\",INDEX({\"Muharram\";\"Shafar\";\"Rabi'ul Awwal\";\"Rabi’ul Akhir\";\"Jumadil Awwal\";\"Jumadil Akhir\";\"Rajab\";\"Sya'ban\";\"Ramadhan\";\"Syawwal\";\"Dzulqa'dah\";\"Dzulhijjah\"},MATCH(F3,{1;2;3;4;5;6;7;8;9;10;11;12},0)),\"\")","v":"Dzulhijjah"},{"$f":"IF(D6=\"Hijri to Gregori\",CHOOSE(G3,\"January\",\"February\",\"March\",\"April\",\"May\",\"June\",\"July\",\"August\",\"September\",\"October\",\"November\",\"December\"),\"\")","v":""}]
[4,"April","Rabi’ul Akhir","Linked Cell",{"$f":"IF($D$6=\"Gregori to Hijri\",INDEX(gregori,ROWS($A$1:A4)),INDEX(hijri,ROWS($A$1:A4)))","v":"April"},{"$f":"IF(D6=\"Gregori to Hijri\",INT((1720995+INT(IF(D8<3,D10-1,D10)*365.25)+INT((IF(D8<3,D8+12,D8)+1)*30.6)+D7+IF(IF(IF(D8<3,D10-1,D10)>1582,TRUE,IF(IF(D8<3,D8+12,D8)>11,TRUE,IF(D7>=15,TRUE,FALSE))),2-INT(IF(D8<3,D10-1,D10)/100)+INT(INT(IF(D8<3,D10-1,D10)/100)/4),0)-1948440)/10631)*30+SUM(IF(MOD(1720995+INT(IF(D8<3,D10-1,D10)*365.25)+INT((IF(D8<3,D8+12,D8)+1)*30.6)+D7+IF(IF(IF(D8<3,D10-1,D10)>1582,TRUE,IF(IF(D8<3,D8+12,D8)>11,TRUE,IF(D7>=15,TRUE,FALSE))),2-INT(IF(D8<3,D10-1,D10)/100)+INT(INT(IF(D8<3,D10-1,D10)/100)/4),0)-1948440,10631)>{354;709;1063;1417;1771;2126;2480;2835;3189;3543;3898;4252;4606;4961;5315;5670;6024;6378;6733;7087;7441;7796;8150;8504;8859;9213;9568;9922;10276},1,0))+1,\"\")","v":1397},{"$f":"IF(D6=\"Hijri to Gregori\",IF((F7>2),(F7-4716),(F7-4715)),\"\")","v":""}]
[5,"May","Jumadil Awwal","Gregori to Hijri",{"$f":"IF($D$6=\"Gregori to Hijri\",INDEX(gregori,ROWS($A$1:A5)),INDEX(hijri,ROWS($A$1:A5)))","v":"May"},{"$f":"IF(D6=\"Hijri to Gregori\",IF((((INT((D10-1)/30)*10631)+(LOOKUP(MOD((MOD((D10),30)-1),30),{0;1;2;3;4;5;6;7;8;9;10;11;12;13;14;15;16;17;18;19;20;21;22;23;24;25;26;27;28;29},{0;354;709;1063;1417;1771;2126;2480;2835;3189;3543;3898;4252;4606;4961;5315;5670;6024;6378;6733;7087;7441;7796;8150;8504;8859;9213;9568;9922;10276})))+(LOOKUP(D8,{1;2;3;4;5;6;7;8;9;10;11;12},{0;30;59;89;118;148;177;207;236;266;295;325}))+D7-1+1948440<2299161),((INT((D10-1)/30)*10631)+(LOOKUP(MOD((MOD((D10),30)-1),30),{0;1;2;3;4;5;6;7;8;9;10;11;12;13;14;15;16;17;18;19;20;21;22;23;24;25;26;27;28;29},{0;354;709;1063;1417;1771;2126;2480;2835;3189;3543;3898;4252;4606;4961;5315;5670;6024;6378;6733;7087;7441;7796;8150;8504;8859;9213;9568;9922;10276})))+(LOOKUP(D8,{1;2;3;4;5;6;7;8;9;10;11;12},{0;30;59;89;118;148;177;207;236;266;295;325}))+D7-1+1948440,(((((INT((D10-1)/30)*10631)+(LOOKUP(MOD((MOD((D10),30)-1),30),{0;1;2;3;4;5;6;7;8;9;10;11;12;13;14;15;16;17;18;19;20;21;22;23;24;25;26;27;28;29},{0;354;709;1063;1417;1771;2126;2480;2835;3189;3543;3898;4252;4606;4961;5315;5670;6024;6378;6733;7087;7441;7796;8150;8504;8859;9213;9568;9922;10276})))+(LOOKUP(D8,{1;2;3;4;5;6;7;8;9;10;11;12},{0;30;59;89;118;148;177;207;236;266;295;325}))+D7-1+1948440+1)+INT(((((INT((D10-1)/30)*10631)+(LOOKUP(MOD((MOD((D10),30)-1),30),{0;1;2;3;4;5;6;7;8;9;10;11;12;13;14;15;16;17;18;19;20;21;22;23;24;25;26;27;28;29},{0;354;709;1063;1417;1771;2126;2480;2835;3189;3543;3898;4252;4606;4961;5315;5670;6024;6378;6733;7087;7441;7796;8150;8504;8859;9213;9568;9922;10276})))+(LOOKUP(D8,{1;2;3;4;5;6;7;8;9;10;11;12},{0;30;59;89;118;148;177;207;236;266;295;325}))+D7-1+1948440-1867216.25)/36524.25)))-INT((INT(((((INT((D10-1)/30)*10631)+(LOOKUP(MOD((MOD((D10),30)-1),30),{0;1;2;3;4;5;6;7;8;9;10;11;12;13;14;15;16;17;18;19;20;21;22;23;24;25;26;27;28;29},{0;354;709;1063;1417;1771;2126;2480;2835;3189;3543;3898;4252;4606;4961;5315;5670;6024;6378;6733;7087;7441;7796;8150;8504;8859;9213;9568;9922;10276})))+(LOOKUP(D8,{1;2;3;4;5;6;7;8;9;10;11;12},{0;30;59;89;118;148;177;207;236;266;295;325}))+D7-1+1948440-1867216.25)/36524.25))/4))))+1524,\"\")","v":""},{"$f":"IF(D6=\"Gregori to Hijri\",IF(MOD(F5,30)=LOOKUP(MOD(F5,30),{1;5;7;10;13;16;18;21;24;26;29}),\"Leap Year\",\"Common Year\"),IF(DAY(EOMONTH(DATE(G5,2,1),0))=29,\"Leap Year\",\"Common Year\"))","v":"Common Year"}]
[6,"June","Jumadil Akhir","1",{"$f":"IF($D$6=\"Gregori to Hijri\",INDEX(gregori,ROWS($A$1:A6)),INDEX(hijri,ROWS($A$1:A6)))","v":"June"},{"$f":"IF(D6=\"Hijri to Gregori\",INT(((IF((((INT((D10-1)/30)*10631)+(LOOKUP(MOD((MOD((D10),30)-1),30),{0;1;2;3;4;5;6;7;8;9;10;11;12;13;14;15;16;17;18;19;20;21;22;23;24;25;26;27;28;29},{0;354;709;1063;1417;1771;2126;2480;2835;3189;3543;3898;4252;4606;4961;5315;5670;6024;6378;6733;7087;7441;7796;8150;8504;8859;9213;9568;9922;10276})))+(LOOKUP(D8,{1;2;3;4;5;6;7;8;9;10;11;12},{0;30;59;89;118;148;177;207;236;266;295;325}))+D7-1+1948440<2299161),((INT((D10-1)/30)*10631)+(LOOKUP(MOD((MOD((D10),30)-1),30),{0;1;2;3;4;5;6;7;8;9;10;11;12;13;14;15;16;17;18;19;20;21;22;23;24;25;26;27;28;29},{0;354;709;1063;1417;1771;2126;2480;2835;3189;3543;3898;4252;4606;4961;5315;5670;6024;6378;6733;7087;7441;7796;8150;8504;8859;9213;9568;9922;10276})))+(LOOKUP(D8,{1;2;3;4;5;6;7;8;9;10;11;12},{0;30;59;89;118;148;177;207;236;266;295;325}))+D7-1+1948440,(((((INT((D10-1)/30)*10631)+(LOOKUP(MOD((MOD((D10),30)-1),30),{0;1;2;3;4;5;6;7;8;9;10;11;12;13;14;15;16;17;18;19;20;21;22;23;24;25;26;27;28;29},{0;354;709;1063;1417;1771;2126;2480;2835;3189;3543;3898;4252;4606;4961;5315;5670;6024;6378;6733;7087;7441;7796;8150;8504;8859;9213;9568;9922;10276})))+(LOOKUP(D8,{1;2;3;4;5;6;7;8;9;10;11;12},{0;30;59;89;118;148;177;207;236;266;295;325}))+D7-1+1948440+1)+INT(((((INT((D10-1)/30)*10631)+(LOOKUP(MOD((MOD((D10),30)-1),30),{0;1;2;3;4;5;6;7;8;9;10;11;12;13;14;15;16;17;18;19;20;21;22;23;24;25;26;27;28;29},{0;354;709;1063;1417;1771;2126;2480;2835;3189;3543;3898;4252;4606;4961;5315;5670;6024;6378;6733;7087;7441;7796;8150;8504;8859;9213;9568;9922;10276})))+(LOOKUP(D8,{1;2;3;4;5;6;7;8;9;10;11;12},{0;30;59;89;118;148;177;207;236;266;295;325}))+D7-1+1948440-1867216.25)/36524.25)))-INT((INT(((((INT((D10-1)/30)*10631)+(LOOKUP(MOD((MOD((D10),30)-1),30),{0;1;2;3;4;5;6;7;8;9;10;11;12;13;14;15;16;17;18;19;20;21;22;23;24;25;26;27;28;29},{0;354;709;1063;1417;1771;2126;2480;2835;3189;3543;3898;4252;4606;4961;5315;5670;6024;6378;6733;7087;7441;7796;8150;8504;8859;9213;9568;9922;10276})))+(LOOKUP(D8,{1;2;3;4;5;6;7;8;9;10;11;12},{0;30;59;89;118;148;177;207;236;266;295;325}))+D7-1+1948440-1867216.25)/36524.25))/4))))+1524-122.1)/365.25)),\"\")","v":""},{"$f":"IF(D6=\"Gregori to Hijri\",IF(DATEDIF(DATE(D10,D8,D7),TODAY(),\"y\")=0,\"\",DATEDIF(DATE(D10,D8,D7),TODAY(),\"y\")&\" years \")&IF(DATEDIF(DATE(D10,D8,D7),TODAY(),\"ym\")=0,\"\",DATEDIF(DATE(D10,D8,D7),TODAY(),\"ym\")&\" months \")&IF(DATEDIF(DATE(D10,D8,D7),TODAY(),\"md\")=0,\"\",DATEDIF(DATE(D10,D8,D7),TODAY(),\"md\")&\" days\"),IF(DATEDIF(DATE(G5,G3,G2),TODAY(),\"y\")=0,\"\",DATEDIF(DATE(G5,G3,G2),TODAY(),\"y\")&\" years \")&IF(DATEDIF(DATE(G5,G3,G2),TODAY(),\"ym\")=0,\"\",DATEDIF(DATE(G5,G3,G2),TODAY(),\"ym\")&\" months \")&IF(DATEDIF(DATE(G5,G3,G2),TODAY(),\"md\")=0,\"\",DATEDIF(DATE(G5,G3,G2),TODAY(),\"md\")&\" days\"))","v":"37 years 10 months 29 days"}]
[7,"July","Rajab",{"$f":"IFERROR(IFERROR(IFERROR(MATCH(D9,{\"Muharram\";\"Shafar\";\"Rabi'ul Awwal\";\"Rabi’ul Akhir\";\"Jumadil Awwal\";\"Jumadil Akhir\";\"Rajab\";\"Sya'ban\";\"Ramadhan\";\"Syawwal\";\"Dzulqa'dah\";\"Dzulhijjah\"},0),MATCH(D9,{\"january\";\"February\";\"March\";\"April\";\"May\";\"June\";\"July\";\"August\";\"September\";\"October\";\"November\";\"December\"},0)),MATCH(D9,{\"Suro\";\"Sapar\";\"Mulud\";\"Bakdamulud\";\"Jumadilawal\";\"Jumadilakir\";\"Rejeb\";\"Ruwah\";\"Pasa\";\"Sawal\";\"Apit\";\"Besar\"},0)),\"\")","v":12},{"$f":"IF($D$6=\"Gregori to Hijri\",INDEX(gregori,ROWS($A$1:A7)),INDEX(hijri,ROWS($A$1:A7)))","v":"July"},{"$f":"IF(D6=\"Hijri to Gregori\",INT((365.25*INT(((IF((((INT((D10-1)/30)*10631)+(LOOKUP(MOD((MOD((D10),30)-1),30),{0;1;2;3;4;5;6;7;8;9;10;11;12;13;14;15;16;17;18;19;20;21;22;23;24;25;26;27;28;29},{0;354;709;1063;1417;1771;2126;2480;2835;3189;3543;3898;4252;4606;4961;5315;5670;6024;6378;6733;7087;7441;7796;8150;8504;8859;9213;9568;9922;10276})))+(LOOKUP(D8,{1;2;3;4;5;6;7;8;9;10;11;12},{0;30;59;89;118;148;177;207;236;266;295;325}))+D7-1+1948440<2299161),((INT((D10-1)/30)*10631)+(LOOKUP(MOD((MOD((D10),30)-1),30),{0;1;2;3;4;5;6;7;8;9;10;11;12;13;14;15;16;17;18;19;20;21;22;23;24;25;26;27;28;29},{0;354;709;1063;1417;1771;2126;2480;2835;3189;3543;3898;4252;4606;4961;5315;5670;6024;6378;6733;7087;7441;7796;8150;8504;8859;9213;9568;9922;10276})))+(LOOKUP(D8,{1;2;3;4;5;6;7;8;9;10;11;12},{0;30;59;89;118;148;177;207;236;266;295;325}))+D7-1+1948440,(((((INT((D10-1)/30)*10631)+(LOOKUP(MOD((MOD((D10),30)-1),30),{0;1;2;3;4;5;6;7;8;9;10;11;12;13;14;15;16;17;18;19;20;21;22;23;24;25;26;27;28;29},{0;354;709;1063;1417;1771;2126;2480;2835;3189;3543;3898;4252;4606;4961;5315;5670;6024;6378;6733;7087;7441;7796;8150;8504;8859;9213;9568;9922;10276})))+(LOOKUP(D8,{1;2;3;4;5;6;7;8;9;10;11;12},{0;30;59;89;118;148;177;207;236;266;295;325}))+D7-1+1948440+1)+INT(((((INT((D10-1)/30)*10631)+(LOOKUP(MOD((MOD((D10),30)-1),30),{0;1;2;3;4;5;6;7;8;9;10;11;12;13;14;15;16;17;18;19;20;21;22;23;24;25;26;27;28;29},{0;354;709;1063;1417;1771;2126;2480;2835;3189;3543;3898;4252;4606;4961;5315;5670;6024;6378;6733;7087;7441;7796;8150;8504;8859;9213;9568;9922;10276})))+(LOOKUP(D8,{1;2;3;4;5;6;7;8;9;10;11;12},{0;30;59;89;118;148;177;207;236;266;295;325}))+D7-1+1948440-1867216.25)/36524.25)))-INT((INT(((((INT((D10-1)/30)*10631)+(LOOKUP(MOD((MOD((D10),30)-1),30),{0;1;2;3;4;5;6;7;8;9;10;11;12;13;14;15;16;17;18;19;20;21;22;23;24;25;26;27;28;29},{0;354;709;1063;1417;1771;2126;2480;2835;3189;3543;3898;4252;4606;4961;5315;5670;6024;6378;6733;7087;7441;7796;8150;8504;8859;9213;9568;9922;10276})))+(LOOKUP(D8,{1;2;3;4;5;6;7;8;9;10;11;12},{0;30;59;89;118;148;177;207;236;266;295;325}))+D7-1+1948440-1867216.25)/36524.25))/4))))+1524-122.1)/365.25)))),\"\")","v":""}]
[8,"August","Sya'ban","December",{"$f":"IF($D$6=\"Gregori to Hijri\",INDEX(gregori,ROWS($A$1:A8)),INDEX(hijri,ROWS($A$1:A8)))","v":"August"},{"$f":"IF(D6=\"Hijri to Gregori\",INT((((IF((((INT((D10-1)/30)*10631)+(LOOKUP(MOD((MOD((D10),30)-1),30),{0;1;2;3;4;5;6;7;8;9;10;11;12;13;14;15;16;17;18;19;20;21;22;23;24;25;26;27;28;29},{0;354;709;1063;1417;1771;2126;2480;2835;3189;3543;3898;4252;4606;4961;5315;5670;6024;6378;6733;7087;7441;7796;8150;8504;8859;9213;9568;9922;10276})))+(LOOKUP(D8,{1;2;3;4;5;6;7;8;9;10;11;12},{0;30;59;89;118;148;177;207;236;266;295;325}))+D7-1+1948440<2299161),((INT((D10-1)/30)*10631)+(LOOKUP(MOD((MOD((D10),30)-1),30),{0;1;2;3;4;5;6;7;8;9;10;11;12;13;14;15;16;17;18;19;20;21;22;23;24;25;26;27;28;29},{0;354;709;1063;1417;1771;2126;2480;2835;3189;3543;3898;4252;4606;4961;5315;5670;6024;6378;6733;7087;7441;7796;8150;8504;8859;9213;9568;9922;10276})))+(LOOKUP(D8,{1;2;3;4;5;6;7;8;9;10;11;12},{0;30;59;89;118;148;177;207;236;266;295;325}))+D7-1+1948440,(((((INT((D10-1)/30)*10631)+(LOOKUP(MOD((MOD((D10),30)-1),30),{0;1;2;3;4;5;6;7;8;9;10;11;12;13;14;15;16;17;18;19;20;21;22;23;24;25;26;27;28;29},{0;354;709;1063;1417;1771;2126;2480;2835;3189;3543;3898;4252;4606;4961;5315;5670;6024;6378;6733;7087;7441;7796;8150;8504;8859;9213;9568;9922;10276})))+(LOOKUP(D8,{1;2;3;4;5;6;7;8;9;10;11;12},{0;30;59;89;118;148;177;207;236;266;295;325}))+D7-1+1948440+1)+INT(((((INT((D10-1)/30)*10631)+(LOOKUP(MOD((MOD((D10),30)-1),30),{0;1;2;3;4;5;6;7;8;9;10;11;12;13;14;15;16;17;18;19;20;21;22;23;24;25;26;27;28;29},{0;354;709;1063;1417;1771;2126;2480;2835;3189;3543;3898;4252;4606;4961;5315;5670;6024;6378;6733;7087;7441;7796;8150;8504;8859;9213;9568;9922;10276})))+(LOOKUP(D8,{1;2;3;4;5;6;7;8;9;10;11;12},{0;30;59;89;118;148;177;207;236;266;295;325}))+D7-1+1948440-1867216.25)/36524.25)))-INT((INT(((((INT((D10-1)/30)*10631)+(LOOKUP(MOD((MOD((D10),30)-1),30),{0;1;2;3;4;5;6;7;8;9;10;11;12;13;14;15;16;17;18;19;20;21;22;23;24;25;26;27;28;29},{0;354;709;1063;1417;1771;2126;2480;2835;3189;3543;3898;4252;4606;4961;5315;5670;6024;6378;6733;7087;7441;7796;8150;8504;8859;9213;9568;9922;10276})))+(LOOKUP(D8,{1;2;3;4;5;6;7;8;9;10;11;12},{0;30;59;89;118;148;177;207;236;266;295;325}))+D7-1+1948440-1867216.25)/36524.25))/4))))+1524)-(INT((365.25*INT(((IF((((INT((D10-1)/30)*10631)+(LOOKUP(MOD((MOD((D10),30)-1),30),{0;1;2;3;4;5;6;7;8;9;10;11;12;13;14;15;16;17;18;19;20;21;22;23;24;25;26;27;28;29},{0;354;709;1063;1417;1771;2126;2480;2835;3189;3543;3898;4252;4606;4961;5315;5670;6024;6378;6733;7087;7441;7796;8150;8504;8859;9213;9568;9922;10276})))+(LOOKUP(D8,{1;2;3;4;5;6;7;8;9;10;11;12},{0;30;59;89;118;148;177;207;236;266;295;325}))+D7-1+1948440<2299161),((INT((D10-1)/30)*10631)+(LOOKUP(MOD((MOD((D10),30)-1),30),{0;1;2;3;4;5;6;7;8;9;10;11;12;13;14;15;16;17;18;19;20;21;22;23;24;25;26;27;28;29},{0;354;709;1063;1417;1771;2126;2480;2835;3189;3543;3898;4252;4606;4961;5315;5670;6024;6378;6733;7087;7441;7796;8150;8504;8859;9213;9568;9922;10276})))+(LOOKUP(D8,{1;2;3;4;5;6;7;8;9;10;11;12},{0;30;59;89;118;148;177;207;236;266;295;325}))+D7-1+1948440,(((((INT((D10-1)/30)*10631)+(LOOKUP(MOD((MOD((D10),30)-1),30),{0;1;2;3;4;5;6;7;8;9;10;11;12;13;14;15;16;17;18;19;20;21;22;23;24;25;26;27;28;29},{0;354;709;1063;1417;1771;2126;2480;2835;3189;3543;3898;4252;4606;4961;5315;5670;6024;6378;6733;7087;7441;7796;8150;8504;8859;9213;9568;9922;10276})))+(LOOKUP(D8,{1;2;3;4;5;6;7;8;9;10;11;12},{0;30;59;89;118;148;177;207;236;266;295;325}))+D7-1+1948440+1)+INT(((((INT((D10-1)/30)*10631)+(LOOKUP(MOD((MOD((D10),30)-1),30),{0;1;2;3;4;5;6;7;8;9;10;11;12;13;14;15;16;17;18;19;20;21;22;23;24;25;26;27;28;29},{0;354;709;1063;1417;1771;2126;2480;2835;3189;3543;3898;4252;4606;4961;5315;5670;6024;6378;6733;7087;7441;7796;8150;8504;8859;9213;9568;9922;10276})))+(LOOKUP(D8,{1;2;3;4;5;6;7;8;9;10;11;12},{0;30;59;89;118;148;177;207;236;266;295;325}))+D7-1+1948440-1867216.25)/36524.25)))-INT((INT(((((INT((D10-1)/30)*10631)+(LOOKUP(MOD((MOD((D10),30)-1),30),{0;1;2;3;4;5;6;7;8;9;10;11;12;13;14;15;16;17;18;19;20;21;22;23;24;25;26;27;28;29},{0;354;709;1063;1417;1771;2126;2480;2835;3189;3543;3898;4252;4606;4961;5315;5670;6024;6378;6733;7087;7441;7796;8150;8504;8859;9213;9568;9922;10276})))+(LOOKUP(D8,{1;2;3;4;5;6;7;8;9;10;11;12},{0;30;59;89;118;148;177;207;236;266;295;325}))+D7-1+1948440-1867216.25)/36524.25))/4))))+1524-122.1)/365.25))))))/30.6001)),\"\")","v":""}]
[9,"September","Ramadhan","1977",{"$f":"IF($D$6=\"Gregori to Hijri\",INDEX(gregori,ROWS($A$1:A9)),INDEX(hijri,ROWS($A$1:A9)))","v":"September"}]
[10,"October","Syawwal",{"$f":"IF(D6=\"Gregori to Hijri\",IF(MOD(D10,30)=LOOKUP(MOD(D10,30),{1;5;7;10;13;16;18;21;24;26;29}),\"Leap Year\",\"Common Year\"),IF(DAY(EOMONTH(DATE(D10,2,1),0))=29,\"Leap Year\",\"Common Year\"))","v":"Common Year"},{"$f":"IF($D$6=\"Gregori to Hijri\",INDEX(gregori,ROWS($A$1:A10)),INDEX(hijri,ROWS($A$1:A10)))","v":"October"}]
[11,"November","Dzulqa'dah",null,{"$f":"IF($D$6=\"Gregori to Hijri\",INDEX(gregori,ROWS($A$1:A11)),INDEX(hijri,ROWS($A$1:A11)))","v":"November"}]
[12,"December","Dzulhijjah",null,{"$f":"IF($D$6=\"Gregori to Hijri\",INDEX(gregori,ROWS($A$1:A12)),INDEX(hijri,ROWS($A$1:A12)))","v":"December"}]
[13]
[14]
[15]
[16]
[17]
[18]
[19]
[20]
[21]
[22]
[23]
[24]
[25]
[26]
[27]
[28]
[29]
[30]
[31]