{"text_format":"3","workbook":"xlsx","n_sheets":13,"sheets":["DocInfo","QM Form","Save Data Base","Grading","Reports","Dummy Data","Agent Data Sheet","Sheet1","Sheet2","QM Guidelines","Sheet3","Lists","Roster"],"not_rendered":{"images":10,"macros":1,"defined_names":104,"pivot_tables":5},"read":"whole","date_system":"1900"}

{"sheet":"DocInfo","index":0,"n_rows":23,"n_cols":6,"rows_kept":23,"hidden":true,"merged":[[3,2,5,5],[12,2,12,3],[13,2,13,3],[14,2,14,3],[15,2,15,3],[16,2,16,3],[19,1,19,2]]}
[]
[]
[]
[null,null,"DISCLAIMER: This document is classified as proprietary of Allan Rey Nunag, Manila, Philippines. Information contained in this document is confidential. No part of this document may be copied, reproduced, stored in a retrieval system, or transmitted without prior written permission of Allan Rey Nunag."]
[]
[]
[]
[]
[]
[]
{"$rows_left_out":14}
{"sheet":"QM Form","index":1,"n_rows":35,"n_cols":14,"rows_kept":35,"merged":[[1,3,1,12],[5,4,5,6],[5,10,5,17],[6,4,6,6],[6,10,6,17],[7,4,7,6],[7,10,7,17],[8,4,8,6],[8,10,8,17],[9,4,9,6],[9,10,9,17],[11,3,11,4],[11,9,11,17],[12,3,12,4],[12,9,20,17],[13,3,13,4],[14,3,14,4],[15,3,15,4],[16,3,16,4],[17,3,17,4],[18,3,18,4],[19,3,19,4],[22,3,22,4],[22,9,22,17],[23,3,23,4],[23,9,30,17],[24,3,24,4],[25,3,25,4],[26,3,26,4],[27,3,27,4],[28,3,28,4],[29,3,29,4],[32,3,32,4],[32,9,32,17],[33,9,37,17],[43,3,43,4],[43,9,43,11]]}
[]
[{"$nulls":3},"INBOUND MONITORING FORM"]
[]
[{"$nulls":4},"Ref # ===>",26,{"$nulls":3},{"$f":"\"of \"&MAX('Save Data Base'!$A:$A)","v":"of 0"}]
[]
[{"$nulls":3},"Work Week Monitored","AS",{"$nulls":4},"Overall Score",{"$f":"IF(K7=\"\",\"\",IF(G35=-100,0,((K7+K8))))","v":{"v":83.5,"d":"83.50"}}]
[{"$nulls":3},"Agent's Name",{"$nulls":5},"Call Management",{"$f":"F21","v":{"v":30,"d":"30.00"}}]
[{"$nulls":3},"Team Leader",{"$nulls":5},"Call Accuracy",{"$f":"F31","v":{"v":53.5,"d":"53.50"}}]
[{"$nulls":3},"Ticket Number",{"$nulls":5},"Call Reason","About a Groupon I bought, and I received the service/product - Delivered Goods - Missing quantity or empty package. (3I11)"]
[{"$nulls":3},"Evaluator's Name",{"$nulls":5},"Monitoring"]
{"$rows_left_out":26}
{"sheet":"Save Data Base","index":2,"n_rows":1,"n_cols":26,"rows_kept":1}
["Ref #","Work Week Monitored","Agent's Name","Team Leader","Ticket Number","Evaluator's Name","Overall Score","Call Management","Call Accuracy","Call Reason","Greeting and closing","Account Verification","Effective Communication","Phone Ticket Content","Zendesk Tagging","Reason Code","Customer engagement and issue identification","Correct information & solution ","Education/complementary information","Correct Policy and Procedure","RDT Reference","Critical Fails","Strengths","Opportunities","Comments","Monitoring"]

{"sheet":"Grading","index":3,"n_rows":7,"n_cols":6,"rows_kept":7,"hidden":true,"merged":[[0,0,1,0]]}
["Score","Excellent","Fair","Poor","Not Delivered","N/A"]
[null,{"v":1,"d":"100%"},{"v":0.85,"d":"85%"},{"v":0.5,"d":"50%"},{"v":0,"d":"0%"},{"v":1,"d":"100%"}]
[5,{"v":5,"d":"5.0"},{"$f":"A3*C2","v":{"v":4.25,"d":"4.3"}},{"$f":"A3*D2","v":2.5},{"v":0,"d":"0.0"},{"v":5,"d":"5.0"}]
[10,{"v":10,"d":"10.0"},{"$f":"A4*C2","v":8.5},{"$f":"A4*D2","v":{"v":5,"d":"5.0"}},{"v":0,"d":"0.0"},{"v":10,"d":"10.0"}]
[15,{"v":15,"d":"15.0"},{"$f":"A5*C2","v":{"v":12.75,"d":"12.8"}},{"$f":"A5*D2","v":7.5},{"v":0,"d":"0.0"},{"v":15,"d":"15.0"}]
[30,{"v":30,"d":"30.0"},{"$f":"A6*C2","v":25.5},{"$f":"A6*D2","v":{"v":15,"d":"15.0"}},{"v":0,"d":"0.0"},{"v":30,"d":"30.0"}]
[null,{"v":-100,"d":"-100.0"}]

{"sheet":"Reports","index":4,"n_rows":5,"n_cols":13,"rows_kept":5,"hidden":true}
["Work Week Monitored","(All)",null,null,"Work Week Monitored","(All)",null,"Work Week Monitored","(All)",null,null,"Work Week Monitored","(All)"]
[]
["Row Labels","Average of Overall Score",null,null,"Row Labels","Average of Overall Score",null,"Row Labels","Average of Overall Score",null,null,"Row Labels","Count of Overall Score"]
["(blank)",{"$nulls":3},"(blank)",null,null,"(blank)",{"$nulls":3},"(blank)"]
["Grand Total",{"$nulls":3},"Grand Total",null,null,"Grand Total",{"$nulls":3},"Grand Total"]

{"sheet":"Dummy Data","index":5,"n_rows":57,"n_cols":26,"rows_kept":57,"hidden":true}
[{"$nulls":8},"Team Summary",{"$nulls":9},10,11,12]
[null,"Phone",{"$nulls":7},1,2,3,4,5,6,7,8,9,"Targets"]
["WW Monitored",null,"WW Name",{"$nulls":3},"WW Monitored",null,null,"WW","# of transactions (Accuracy)","Ave. Accuracy Score","# of transactions (Handling)","Ave. Handling Score","# of fatal","%FA","# of non-fatal","%NFA","Ave. Score","% fatal Accuracy","% non-fatal accuracy"]
[null,1,{"$f":"\"WW\"&$A4","v":"WW"},{"$nulls":6},{"$f":"C4","v":"WW"}]
[null,2,{"$f":"\"WW\"&$A5","v":"WW"},{"$nulls":6},"WW"]
[null,3,{"$f":"\"WW\"&$A6","v":"WW"},{"$nulls":6},"WW"]
[null,4,{"$f":"\"WW\"&$A7","v":"WW"},{"$nulls":6},"WW"]
[null,5,{"$f":"\"WW\"&$A8","v":"WW"},{"$nulls":6},"WW"]
[null,6,"Monthly",{"$nulls":6},"Monthly"]
[]
{"$rows_left_out":48}
{"sheet":"Agent Data Sheet","index":6,"n_rows":9,"n_cols":103,"rows_kept":9,"hidden":true,"merged":[[7,2,7,7],[7,8,7,13],[7,14,7,19],[7,20,7,25],[7,26,7,31],[7,32,7,37],[7,73,7,78],[7,79,7,84],[7,85,7,90]]}
[{"$nulls":4},1,"Ave. Accuracy Score",{"$nulls":4},"No. TM","FNF Actual","FNF Target","Ave Actual","AveTarget","Acc Freq","Han Freq","ACName","ACTM","ACFNFActual","ACFNFTarget","ACAveActual","ACAveTarget"]
[null,"WW",6,{"$f":"LOOKUP($C$2,'Dummy Data'!$B$4:$B$9,'Dummy Data'!$A$4:$A$9)","v":0},2,{"$nulls":4},"Rows",{"$f":"$D$3","v":0},0,0,0,0,0,0,1,1,1,1,1,1,{"$nulls":49},{"$f":"SUM(BU10:BU10)","v":0},0,0,0,0,0,0,0,0,0,0,0]
[null,"Agent #",2,null,1,"% Fatal Accuracy",{"$nulls":3},"Cols",{"$f":"IF($D$5=1,2,14)","v":14},{"$f":"IF($D$4=1,20,32)","v":32},{"$f":"IF($D$4=1,79,85)","v":85},8,73,38,{"$f":"IF($D$2=6,60,93)","v":93},1,{"$f":"1+$D$2","v":1},{"$f":"IF($D$4=1,19+$D$2,31+$D$2)","v":31},{"$f":"IF($D$4=1,78+$D$2,84+$D$2)","v":84},{"$f":"7+$D$2","v":7},{"$f":"72+$D$2","v":72}]
[null,"F-NF Report Type",2,null,2,"% Non-Fatal Accuracy",{"$nulls":3},"Hght",1,1,1,1,1,1,1,{"$f":"IF(MAX($B:$B)<1,1,MAX($B:$B))","v":1},1,1,1,1,1]
[null,"Ave. Report Type",1,{"$nulls":6},"Width",6,6,6,6,6,17,22,1,1,1,1,1,1]
[{"$nulls":85},"Targets"]
[null,1,2,3,4,5,6,7,8,9,10,11,12,13,14,15,16,17,18,19,20,21,22,23,24,25,26,27,28,29,30,31,32,33,34,35,36,37,38,39,40,41,42,43,44,45,46,47,48,49,50,51,52,53,54,55,56,57,58,59,60,61,62,63,64,65,66,67,68,69,70,71,72,73,74,75,76,77,78,79,80,81,82,83,84,85,86,87,88,89,90,91,92,93,94,95,96,97,98,99,100,101,102]
[null,null,"# of transactions monitored (Accuracy)",{"$nulls":5},"Ave. Accuracy Score",{"$nulls":5},"# of Fatal Transaction",{"$nulls":5},"% Fatal Accuracy",{"$nulls":5},"# of Non-Fatal Transaction",{"$nulls":5},"% Non-Fatal Accuracy",{"$nulls":5},"Monthly",{"$nulls":16},"WEEKLY",{"$nulls":17},"Ave. Score",{"$nulls":5},"% Fatal Accuracy",{"$nulls":5},"% Non-fatal Accuracy"]
[null,"Agent's Name",{"$f":"'Dummy Data'!$C$4","v":"WW"},{"$f":"'Dummy Data'!$C$5","v":"WW"},{"$f":"'Dummy Data'!$C$6","v":"WW"},{"$f":"'Dummy Data'!$C$7","v":"WW"},{"$f":"'Dummy Data'!$C$8","v":"WW"},{"$f":"'Dummy Data'!$C$9","v":"Monthly"},{"$f":"'Dummy Data'!$C$4","v":"WW"},{"$f":"'Dummy Data'!$C$5","v":"WW"},{"$f":"'Dummy Data'!$C$6","v":"WW"},{"$f":"'Dummy Data'!$C$7","v":"WW"},{"$f":"'Dummy Data'!$C$8","v":"WW"},{"$f":"'Dummy Data'!$C$9","v":"Monthly"},{"$f":"'Dummy Data'!$C$4","v":"WW"},{"$f":"'Dummy Data'!$C$5","v":"WW"},{"$f":"'Dummy Data'!$C$6","v":"WW"},{"$f":"'Dummy Data'!$C$7","v":"WW"},{"$f":"'Dummy Data'!$C$8","v":"WW"},{"$f":"'Dummy Data'!$C$9","v":"Monthly"},{"$f":"'Dummy Data'!$C$4","v":"WW"},{"$f":"'Dummy Data'!$C$5","v":"WW"},{"$f":"'Dummy Data'!$C$6","v":"WW"},{"$f":"'Dummy Data'!$C$7","v":"WW"},{"$f":"'Dummy Data'!$C$8","v":"WW"},{"$f":"'Dummy Data'!$C$9","v":"Monthly"},{"$f":"'Dummy Data'!$C$4","v":"WW"},{"$f":"'Dummy Data'!$C$5","v":"WW"},{"$f":"'Dummy Data'!$C$6","v":"WW"},{"$f":"'Dummy Data'!$C$7","v":"WW"},{"$f":"'Dummy Data'!$C$8","v":"WW"},{"$f":"'Dummy Data'!$C$9","v":"Monthly"},{"$f":"'Dummy Data'!$C$4","v":"WW"},{"$f":"'Dummy Data'!$C$5","v":"WW"},{"$f":"'Dummy Data'!$C$6","v":"WW"},{"$f":"'Dummy Data'!$C$7","v":"WW"},{"$f":"'Dummy Data'!$C$8","v":"WW"},{"$f":"'Dummy Data'!$C$9","v":"Monthly"},"Did the engineer follow the complete and appropriate opening greetings on the initial email? ","Did the engineer inform the customer that the schedule and contact information is included in the email?","Did the engineer set expectation?","Did the engineer make a value statement?","Did the engineer expressed ideas and thoughts coherently?","Did the engineer sequenced statements acceptably for the customer?","Is the email and/or case notes format conscious?","Did the engineer positively represent Cisco products and services?","Did the engineer apologize appropriately?","Did the engineer take ownership of the case?","Did the engineer relate and tailor his responses to suit customer's needs and situation/s?","Did the engineer exhibit basic courtesy?","Did the engineer initiate establishing rapport with the customer?","Did the engineer use appropriate vocabulary and choice of words?","Did the engineer use appropriate sentence construction and grammar?","Did the engineer use appropriate punctuation, spelling, upper / lower case?",null,"Did the engineer follow the complete and appropriate opening greetings on the initial email? ","Did the engineer inform the customer that the schedule and contact information is included in the email?","Did the engineer set expectation?","Did the engineer make a value statement?","Did the engineer expressed ideas and thoughts coherently?","Did the engineer sequenced statements acceptably for the customer?","Is the email and/or case notes format conscious?","Did the engineer positively represent Cisco products and services?","Did the engineer apologize appropriately?","Did the engineer take ownership of the case?","Did the engineer relate and tailor his responses to suit customer's needs and situation/s?","Did the engineer exhibit basic courtesy?","Did the engineer initiate establishing rapport with the customer?","Did the engineer use appropriate vocabulary and choice of words?","Did the engineer use appropriate sentence construction and grammar?","Did the engineer use appropriate punctuation, spelling, upper / lower case?",null,"",{"$f":"'Dummy Data'!$C$4","v":"WW"},{"$f":"'Dummy Data'!$C$5","v":"WW"},{"$f":"'Dummy Data'!$C$6","v":"WW"},{"$f":"'Dummy Data'!$C$7","v":"WW"},{"$f":"'Dummy Data'!$C$8","v":"WW"},{"$f":"'Dummy Data'!$C$9","v":"Monthly"},{"$f":"'Dummy Data'!$C$4","v":"WW"},{"$f":"'Dummy Data'!$C$5","v":"WW"},{"$f":"'Dummy Data'!$C$6","v":"WW"},{"$f":"'Dummy Data'!$C$7","v":"WW"},{"$f":"'Dummy Data'!$C$8","v":"WW"},{"$f":"'Dummy Data'!$C$9","v":"Monthly"},{"$f":"'Dummy Data'!$C$4","v":"WW"},{"$f":"'Dummy Data'!$C$5","v":"WW"},{"$f":"'Dummy Data'!$C$6","v":"WW"},{"$f":"'Dummy Data'!$C$7","v":"WW"},{"$f":"'Dummy Data'!$C$8","v":"WW"},{"$f":"'Dummy Data'!$C$9","v":"Monthly"}]

{"sheet":"Sheet1","index":7,"n_rows":5,"n_cols":7,"rows_kept":5,"hidden":true,"merged":[[0,0,0,2]]}
["Performance Scale Rating",{"$nulls":4},"Work Week Monitored","(Multiple Items)"]
["2.80-3.00","Excellent Performance"]
["2.55-2.79","Good Performance","Needs to be Fast-tracked for Development",null,null,"TEAM","AVE"]
["2.31-2.54","Acceptable Performance","Needs Supportive Coaching Plan.",null,null,"Grand Total"]
["0.00-2.30","Critical Performance","Redirection needed"]

{"sheet":"Sheet2","index":8,"n_rows":5,"n_cols":13,"rows_kept":5,"hidden":true,"merged":[[1,1,1,5],[1,6,1,10],[1,11,1,12],[2,1,2,3],[2,4,2,5],[2,6,2,8],[2,9,2,10]]}
[]
[null,"Call Management (50%)",{"$nulls":4},"Call Accuracy (50%)",{"$nulls":4},"Others"]
[null,"Courtesy (30%)",null,null,"Communication Skill (20%)",null,"Case Resolution (40%)",null,null,"Data Entry (10%)",null,"Upselling (+10%)","Zero Tolerance"]
[null,"a).  Appropriate Greeting and Closing (3%)","b). Addressing Customer Appropriately (2%)","c).  Professionalism (25%) ","a).Effective Communication (10%)","b). Listening Skill (10%)","a).  Giving correct answer/solutions on customer's concern (20%)","b). Call and Order Processing Efficiency (10%)","c). Proactive assistance/Helpfulness (10%)","a).  Complete report in Order Management System (5%)","b). Complete ticket in Zendesk (5%)","a).  Upselling customer if in a sales situation","a).  Any unacceptable behavior"]
[null,"Delivered the opening spiel and closing spiel (verbatim).\n\nOpening Spiel: \n-Thank the customer\n-Brand Lazada\n-State your name\n-Offer to assist the customer\n“Thank you for calling Lazada Philippines, this is (NAME), how can I help you today?”\n\nClosing Spiel: \n-Offered additional assistance: \n-Thank the customer\n-Rebrand Lazada\n-Appreciation statement\n\"Is there anything else I can help you with?\"\n\"Thank you for shopping at Lazada\". or \"Thank you for calling Lazada\".","Addressed the customer by name at least twice within the call","1. Positive Initial Response (PIR) - Agent provided immediate PIR after the customer stated their issue. \"Empathy Resolution Statement\", you offer a simple apology for the problem followed by a statement of what you are going to do to resolve it. Once done, you can usually move on to focusing on resolution knowing that you've adequately expressed empathy.\n\"I'm sorry that (describe the unmet expectation). What I can/will do is (describe what action you will take).\"\n\n2. Acknowledge/ Empathy/ Assurance - Agent provided and expressed genuine relevant apology/empathy statement as needed all throughout the call. Provided assurance statement indicating ownership of the call.\n\n3. Proper tone of voice - Enthusiastic, Upbeat, Friendly, Polite\n\n4. No Interruption - Agent allowed the customer to express their issue, questions, and concerns without interruption.","Keep the conversation effective without compromising the aims/objectives\n1. Conciseness - means wordiness, i.e., communicating what you want to convey in least possible words (No talk in circle)\n\n2. Consideration - implies “stepping into the shoes of others”. Modifying your words in message to suit the customer's needs while making your message complete and adjusting rate of speech.\n\n3. Clarity - \"Speaks clearly\", Clear message\n\n4. Correctness - implies that there are no grammatical errors in communication.\n\n5. Appropriate Response - Using appropriate words/sentence. No jargons, no fillers, no slang terms. Used of positive words/phrase/sentence - Eliminate negative phrases and replace them with positive ways of conveying the same information.Avoided use of Negative words/phrase/sentence - Words that implies blame, fault or carelessness. Stresses negative consequences. Limits options through restrictive, limiting words and phrases. Focuses on the opposite behavior we want to achieve.","Agent remained focused on the call to avoid unnecessary repetition.","Answered all questions correctly\nCorrectly and efficiently probed to identify customer's issue\nGave correct solution accordance with customers concern\nCorrectly followed SOP\n-Placing an Order\n-Payments\n-Shipping & Delivery\n-Saving Cancellation\n-Returns, Refund and Replacement\n-And other updated process/procedures related to product/services (whether it is cascaded through email/meetings/QA Roll Out)\nSetting proper customers expectations\nEducated customer about online self-help such as Help and Order tracking Tool\nex: “You can also refer to lazada.com.ph/payments for other payment options\"\nOr\n“You can also check the status of your order on Order Tracking Tool on the website\"","No redundant or unnecessary actions\nAvoided Dead air (more than 10sec)\nFollowed Proper Hold Procedure - Agent put the customer on hold only if necessary; Maximum Hold time 1 minute\nI – Inform the customer the reason for hold\nE- Estimate hold time(1minute)\nA- Ask permission\nT- Thank the customer\nSucceeding hold time - 1-2-minutes is acceptable. Only initial hold will be measure.\nCall Control - Agent controlled the pace and direction of the call to efficiently resolve the customer’s issue.\nGathered Basic Information - ask/verify the caller's name, order number, address, e-mail address (whichever is applicable).\nFollowed Customer Verification\nIf a caller requests to modify, to make changes or to cancel an order, agent should correctly follow Customer Verification Procedures.\n1. Complete the Customer Verification: \na. Order Number\nb. Name of the caller (First and last name)\nc. Name of the person who placed the order (customer name)\nd. Shipping Address\n2. If caller failed the customer verification, Agent will advise the caller to ask the person who placed the order to contact customer service.","Agent tried to resolve the problem without having to ask the customer for every step","Complete comment required based on transaction in OMS, specifically the Action Taken and the Reason)\n\nEx: Cancelled order-due to invalid payment) and must notate whatever is applicable such as the dummy order, new tracking number etc.","Agent correctly tagged the case.\n\nAgent completely documented and filled out Zendesk Template. Must include specific and important details notated in OMS. [Customer name; phone number; order number; summary of issue; action]","Successfully sells an upgrade or add-on/accessory to the customer"]

{"sheet":"QM Guidelines","index":9,"n_rows":16,"n_cols":8,"rows_kept":16,"merged":[[0,1,0,7],[1,1,2,1],[1,2,2,2],[1,3,1,7],[3,1,9,1],[5,2,6,2],[10,1,14,1],[15,3,15,5]]}
[null,"Guidelines - Inbound Score Card"]
[null,"Category","Attributes","Parameter Description"]
[{"$nulls":3},"Excellent","Excellent (100%)","Fair (85%)","Poor (50%)","Not Delivered (0%)"]
[null,"Communication Skills and Data Capture 40%","a).  Greeting and Closing (5%)","Delivered the opening spiel and closing spiel (verbatim) by using the best voice to represent the company professionally.\n\nOpening Spiel: Thank the customer and Brand Groupon, State your name, Offer to assist the customer\n“Thank you for calling Groupon, My name is (NAME), how may I help you today?”\n\nClosing Spiel: Thank the customer, Rebrand Groupon, Appreciation statement:\n\"Thank you for shopping at Groupon\". or \"Thank you for calling Groupon\"."]
[null,null,"b). Account Verification (5%)","- Account has to be successfully verified (First name and Last name indicated on the account."]
[null,null,"c). Effective Communication (15%)"]
[{"$nulls":3},"- Means wordiness, i.e., communicating what you want to convey in least possible words (no talk in circle). \n- Implies that there are no grammatical errors in communication.\n- Focus on customer's information and condition to avoid unnecessary repetition and misunderstanding on receiving information or even did not get the message from customer.\n- Allowed the customer to finish statement before further assisting (no interruption).\n- Apologize if the customers has been accidentally interrupted and let them continue their statement\n- Using appropriate words/sentences. No jargons, no fillers, no slang terms. \n- Used of positive words/phrase/sentence, eliminate negative phrases and replace them with positive ways of conveying the same information. \n- Avoid dead air or mute (more than 5 sec)\n- Provided empathy statements on a timely manner or as required.\n- Provided an assurance statement to show willingness to assist."]
[null,null,"d.) Phone Ticket Content (10%)"," - Phone ticket content is complete and all information discussed to the customer during phone conversation (time frames, account specific, escalations, etc.) have been properly documented and accounted for.\n- Used all necessary macros as directed by RDT, PDT or Promotions Decision Tree.\n- Proper setting of status of ticket (Solved, On-Hold, Pending, Open).\n- Filled out necessary fields and ticked the boxes as required (Requester, Ticket Owner, Escalated?)","Addressed the customer by name twice, or mentioned wrong name but say apology for it.","Addressed the customer by name only once or mentioned wrong name and did not apologize for it.",null,"Not Delivered"]
[null,null,"e.) Zendesk Tagging (Perma Link, Refund Related) (5%)"," - Used correct permalink.\n- Used appropriate tagging for \"Refund Related?\" field.","Missed 1 parameter","Missed more than 1 parameter",null,"Not Delivered"]
[null,null,"f.) Zendesk Reason & Refund Reason"," - Correctly tagged the Zendesk Reason field.\n- Accurately tagged the Refund Reason field.\n- Used same Refund Reason on ZT as provided on Cyclops.","Initiate conversation or respond to trigger signal to get  a customer response but then did not build upon personal emotional connection.","Tried to build the connection but with the wrong or not appropriate way and showed no impact on it",null,"Not Delivered"]
{"$rows_left_out":7}
{"sheet":"Sheet3","index":10,"n_rows":0,"n_cols":0,"rows_kept":0,"hidden":true}

{"sheet":"Lists","index":11,"n_rows":98,"n_cols":13,"rows_kept":98}
[]
[]
[]
[null,"Call Reason",{"$nulls":6},"Agent's Name",null,"Monitoring",null,"Evaluator's Name"]
[1,"About a Groupon I bought, and I received the service/product - Delivered Goods - Complaint about courier or delivery service. (3I8)",{"$nulls":8},"SBS",null,"Allan Nunag"]
[2,"About a Groupon I bought, and I received the service/product - Delivered Goods - General questions on how to return a shipped product. (3I4)",{"$nulls":8},"Remote"]
[3,"About a Groupon I bought, and I received the service/product - Delivered Goods - Missing quantity or empty package. (3I11)"]
[4,"About a Groupon I bought, and I received the service/product - Delivered Goods - Product features and specifications different from what was advertised. (3I3c)"]
[5,"About a Groupon I bought, and I received the service/product - Delivered Goods - Product had missing parts. (3I2)"]
[6,"About a Groupon I bought, and I received the service/product - Delivered Goods - Product is defective or not working (box was not damaged). (3I1)"]
{"$rows_left_out":89}
{"sheet":"Roster","index":12,"n_rows":1,"n_cols":6,"rows_kept":1}
["Asternic ID","Team Lead","Channel","QAS","Ext","Date of Hire"]